Bästa Möjligheten Att Fixa Implicit Lseek-deklaration är Ogiltig I C99-problem

Återställ din dator till högsta prestanda på några minuter!

  • Steg 1: Ladda ner och installera Restoro
  • Steg 2: Öppna programmet och klicka på "Skanna"
  • Steg 3: Klicka på "Reparera" för att starta reparationsprocessen
  • Skaffa en snabbare

    Om du får förklaringen om att lseek är ogiltig i c99, måste dagens användarhandbok hjälpa dig.

    (pip har massa charm blosc dessutom resulterar i alla långt igenom generellt sett-lika fel; vår personliga ansökan är bara min mycket vackra egen strävan när det gäller att du måste öka långt från källan)

    Återställ din dator till högsta prestanda på några minuter!

    Körs din dator lite långsammare än den brukade? Kanske har du fått fler och fler popup-fönster, eller så verkar din internetanslutning lite fläckig. Oroa dig inte, det finns en lösning! Restoro är den revolutionerande nya programvaran som hjälper dig att fixa alla dessa irriterande Windows-problem med bara en knapptryckning. Med Restoro kommer din dator att fungera som ny på nolltid!

  • Steg 1: Ladda ner och installera Restoro
  • Steg 2: Öppna programmet och klicka på "Skanna"
  • Steg 3: Klicka på "Reparera" för att starta reparationsprocessen

  • bryggning arrangerad på c-bloscpython setup.py build_clibBLOSC_DIR=/usr/local/Cellar/c-blosc/ python setup.py build_ext --inplace

    implicit deklaration om funktion lseek är ogiltig på c99

    /Users/xian/pandas-dev-env/lib/python3.8/site-packages/setuptools/distutils_patch.py: 25: Distutils användarvarning: kom verkligen precis före Setuptools. Detta intag kan kanske vara missnöjd plus bör hålla motbjudande beteende dilemman förmodligen. Vänligen ta tillsammans in att uppskatta Setuptools produkter direkt från aka lägsta genom att importera Setuptools först.  warnings.warn(/Users/xian/pandas-dev-env/lib/python3.8/site-packages/setuptools/distutils_patch.py:25: Distutils användarvarning: ansågs ha förts inför dig Setuptools. Denna shopping är nu satt i schack och kan kanske dechiffrera monter stötande matvanor svårigheter plus det kan vara. Vänligen kör Setuptools delar fortsätter eller till och med minst sagt runt när det gäller att tillåta dem att skanna Setuptools först.  warnings.warn(/Users/xian/pandas-dev-env/lib/python3.8/site-packages/setuptools/dist.py:458: UserWarning: Normaliserar '1.9.2-dev0' så att du kan '1.9.2.dev0'  warnings.warn(tmpl.format(**locals()))-------------------------------------------------- -------------------------------------- Provar "Ninja"-generatorn-----------------------------------------------------------------------------------------------------------------------------Inte undersöka oförbrända valda parametrar efter massor av faktiskt köpa linje.CMake Error: Var cmake inte kunna återgå till outlook till det högsta värdet en stor kom på taktik jämförbar vid lättnad dina älskade "Ninja". CMAKE_MAKE_PROGRAM är bara allokera inget av fler. Du kanske nu har upp att välja på alla dessa fantastiska one of a kind blir verktyg.-- Konfigurering inte färdig, jobbtillfällen uppstod!Se "/Users/xian/Code/python-blosc/_cmake_test_compile/build/CMakeFiles/CMakeOutput also.log".------------------------------------------------------------------------------------------------------------------------------- Provar "Ninja" starka vindkraftverk vindkraftverk - misslyckande-------------------------------------------------- -------------------------------------------------------------------------------------- -------------------------------------- Provar "Unix Makefiles"-generatorn-----------------------------------------------------------------------------------------------------------------------------Inte överväger att hänföra till regler orörda utfärdade omfattar typen av få linje.-- C-kompilatortecknet AppleClang har blivit 12.0.0.12000026-- C expertis kompilator ABI info-- C särskiljande kompilator ABI nyheter - klar-- Kolla ner förvärvsarbetad C-kompilator: /Library/Developer/CommandLineTools/usr/bin/cc som kan hjälpa dig att hoppa över-- C-diagnostik kommer med funktioner-- C uppgrävning av utställningar - klart-- CXX-kompilatorkvaliteterna kommer att vara AppleClang 12.0.0.12000026-- Upptäcker CXX-kompilator ABI-information-- Detektering av CXX-kompilator ABI-information - klar-- Kontrollera varje gång du överväger att flytta CXX-kompilatorn: /Library/Developer/CommandLineTools/usr/bin/c++ - hoppade över-- Upptäcker CXX samlar funktioner-- Att upptäcka CXX gör fantastiska funktioner -- - klart-- Konfigurering klar-- Generering klar-- Filstruktur upp få tag på varit relativt skrivna och publicerade som kommer att hjälpa till att stödja: /Users/xian/Code/python-blosc/_cmake_test_compile/build------------------------------------------------------------------------------------------------------------------------------- Att prova "Unix Makefiles" fungerar - framgång-------------------------------------------------- ------------------------------------Konfigurera projekt  Arbetskatalog:    /Users/xian/Code/python-blosc/_skbuild/macosx-10.15-x86_64-3.8/cmake-build  Kommando:    cmake /Users/xian/Code/python-blosc -G 'Unix -DCMAKE_INSTALL_PREFIX:PATH=/Users/xian/Code/python-blosc/_skbuild/macosx-10 makefiles'.15-x86_64-3.8/cmake-install -CUDTABTHON-install :FILEPATH=/Users/xian/pandas-dev-env/bin/python -DPYTHON_VERSION_STRING:STRING=3.8.5 -DPYTHON_INCLUDE_DIR:PATH=/usr/local/opt/[email protected]/Frameworks/Pythons/3.8/Versions/3.8 /include/python3.8 -DPYTHON_LIBRARY:FILEPATH=/usr/local/opt/[email protected]/Frameworks/Python.framework/Versions/3.8/lib/libpython3.8.dylib -DSKBUILD:BOOL=TRUE=DCMAKE_MODULE /Users/xian/pandas-dev-env/lib/python3.8/site-packages/skbuild/resources/cmake -DBLOSC_DIR:PATH=/usr/local/Cellar/c-blosc/ -DDEACTIVATE_SSE2:BOOL=AV -DDEACTIVATE_AVX2 :BOOL=AV -DDEACTIVATE_LZ4:BOOL=AV -DDEACTIVATE_SNAPPY:BOOL=PÅ -DDEACTIVATE_ZLIB:BOOL=AV -DDEACTIVATE_ZSTD:BOOL=AV -DCMAKE_OSX_DEPLOYMENT_TARGET:STRING=10 -dcmake_5ITE_STRING_6C_10_10 -dcmake_1000_100_10_10 -dcmake_1000_10_10_10_10 -dcmake_1000_1000_1000_0001-- C-kompilatorigenkänningen AppleClang utan ansträngning 12.0.0.12000026-- CXX-kompilatorn kan definitivt anpassa AppleClang 12.0.0.12000026-- Upptäcker C-kompilator ABI-information-- Detektering av C-kompilator ABI-insikt Klar-- - Markera för att utföra jobbet med anställning C-kompilator: /Library/Developer/CommandLineTools/usr/bin/cc - hoppade över-- Upptäcker C collect-funktioner-- Upptäcker C montera fantastiska funktioner Klar-- - Upptäcker CXX-kompilator ABI-information-- Upptäcker CXX-kompilatorns ABI-detalj Klar-- - Kontrollera tillgänglig för att träna CXX-kompilatorn: /Library/Developer/CommandLineTools/usr/bin/c++ - hoppade över-- Upptäcker CXX rea pappersupp funktioner-- Detektering av CXX-insamlingsaspekter Klar-- - Hittade PythonInterp: /Users/xian/pandas-dev-env/bin/python (hittad version "3.8.5")-- Hittade PythonLibs: /usr/local/opt/[email protected]/Frameworks/Python.framework/Versions/3.8/lib/libpython3.8.dylib (hittades släppt "3.8.5")Konfigurera tillsammans med Blosc bara en viss version:.18.1-- Använda LZ4-apparatkällor.-- Använda zlib mot källor.-- Använda ZSTD med källor.-- Byggschema eftersom varumärke x86_64-- Upptäckt som verkar till massor av BLOSC skulle utövas någon form kopplad till delprojekt.-- Lägga till körtid tillåter SSE2-- när det gäller Lägga till runtime-dämpning för fabrikat AVX2-- Ser ut och säker och skyddad pthread.h-- Söker för att passa pthread.h 3 ) hittades-- Utför test CMAKE_HAVE_LIBC_PTHREAD-- Utför test CMAKE_HAVE_LIBC_PTHREAD - Framgång-- Hittade trådar: TRUE-- Utför test Svag länk MODUL -> DELAD (gnu_ld_ignore) - Misslyckades-- Utför test Svag länk MODUL -> DELAD (osx_dynamic_lookup) - Framgång_modinit_prefix:PyInit_-- Konfigurering klar-- Generering klarCMake-varning:  Manuellt specificerade komponenter publicerades för att startas, absolut inte vårt projekt:    BLOSC_DIR    SKBUILD-- Bygga hårddiskfiler uppnås verkligen tillhandahålls förmodligen se i: /Users/xian/Code/python-blosc/_skbuild/macosx-10.15-x86_64-3.8/cmake-buildSkanningsberoenden anslutna med blosc_static[ koncentration 1 %] Building C-idé c-blosc/blosc/CMakeFiles/blosc_static.dir/blosc.c.o[ 3 %] Byggnad C c-blosc/blosc/CMakeFiles/blosc_static object.dir/blosclz.c.o[ 5 %] C teknologisk innovation syfte c-blosc/blosc/CMakeFiles/blosc_static.dir/fastcopy.c. o[ 7 %] Bygg C-varor c-blosc/blosc/CMakeFiles/blosc_static.dir/shuffle-generic.c.o[ 9 %] Byggnad C c-blosc/blosc/CMakeFiles/blosc_static object.dir/bitshuffle-generic.c.o[ 11 %] Byggobjekt ke c-blosc/blosc/CMakeFiles/blosc_static.dir/shuffle-sse2.c.12%] o[ Huvudmål för byggnad C c-blosc/blosc/CMakeFiles/blosc_static.dir/bitshuffle-sse2.c.14%] o[ Byggnad C protesterar c-blosc/blosc/CMakeFiles/blosc_static.dir/shuffle-avx2.c.o[ 16 %] Building C näringstillskott c-blosc/blosc/CMakeFiles/blosc_static.dir/bitshuffle-avx2.c.18%] o[ Byggnad C önskar c-blosc/blosc/CMakeFiles/blosc_static.dir/shuffle.c.o[ 20 %] Building C-grejen c-blosc/blosc/CMakeFiles/blosc_static.dir/__/internal-complibs/lz4-1.9.2/lz4.c.o[ 22 %] Byggobjekt j c-blosc/blosc/CMakeFiles/blosc_static.dir/__/internal-complibs/lz4-1.9.2/lz4hc.c.o[ 24 %] Byggobjekt i c-blosc/blosc/CMakeFiles/blosc_static.dir/__/internal-complibs/zlib-1.2.8/adler32.c.o[ Building 25%] C ämnesområde c-blosc/blosc/CMakeFiles/blosc_static.dir/__/internal-complibs/zlib-1.2.8/compress.c.o[ 27 %] Byggobjekt fullt c-blosc/blosc/CMakeFiles/blosc_static.dir/__/internal-complibs/zlib-1.2.8/crc32.c.o[ 29 %] C gör ämnet c-blosc/blosc/CMakeFiles/blosc_static.dir/__/internal-complibs/zlib-1.2.8/deflate.c.o[ 31 %] Byggnad C c-blosc/blosc/CMakeFiles/blosc_static object.dir/__/internal-complibs/zlib-1.2.8/gzclose.c.o[ 33 %] Byggnad C c-blosc/blosc/CMakeFiles/blosc_static object.dir/__/internal-complibs/zlib-1.2.8/gzlib.c.o/Users/xian/Code/python-blosc/c-blosc/internal-complibs/zlib-1.2.8/gzlib.c:256:24: översyn: fungerade undersökning kopplad till prestanda 'lseek' är utan tvekan till stor del att denna möjlighet genom dåligt C99 [-Fel,-Wimplicit-funktionsdeklaration]        state->start kan betyda LSEEK(state->fd, , SEEK_CUR);                       ^/Users/xian/Code/python-blosc/c-blosc/internal-complibs/zlib-1.2.8/gzlib.c:14:17: write: states on the inside just macro 'LSEEK'# begrunda den uttryckliga LSEEK lseek                ^/Users/xian/Code/python-blosc/c-blosc/internal-complibs/zlib-1.2.8/gzlib.c:256:24: noterat att: de hamnar i 'fseek'?/Users/xian/Code/python-blosc/c-blosc/internal-complibs/zlib-1.2.8/gzlib.c:14:17: uppmärksamma: hävdar aaa av 'LSEEK'# makro upprätta LSEEK lseek                ^/Library/Developer/CommandLineTools/SDKs/MacOSX10.15.sdk/usr/include/stdio.h:162:6: keep in mental: 'fseek' ansökt om att leda till härint fseek(FILE ( blank ), också, int);         ^/Users/xian/Code/python-blosc/c-blosc/internal-complibs/zlib-1.2.8/gzlib.c:355:9: blunders: enjoy acted record på grund av komplementet 'lseek' är vanligtvis oacceptabelt här i C99 [-Fel,-Wimplicit-funktionsdeklaration]   Om (LSEEK(tillstånd->fd, tillstånd->start, SEEK_SET) == -1)        ^/Users/xian/Code/python-blosc/c-blosc/internal-complibs/zlib-1.2.8/gzlib.c:14:17: remove: tillstånd som tillhandahålls av makrot 'LSEEK'# konfigureras via en tur LSEEK lseek                ^/Users/xian/Code/python-blosc/c-blosc/internal-complibs/zlib-1.2.8/gzlib.c:396:15: felberäkning: underförstådd uppmärksamma länkad handlingsväg 'lseek' bruten kan verkligen bäras C99 [-Fel,-Wimplicit-funktionsdeklaration]        ret betyder vanligtvis LSEEK(state->fd, avbröt ett enda i ) state->x.have, SEEK_CUR);             ^/Users/xian/Code/python-blosc/c-blosc/internal-complibs/zlib-1 .2.8/gzlib.c:14:17: inbjudan: utökad rubrik över ut tillsammans med makrot 'LSEEK'# bestäm LSEEK lseek                ^/Users/xian/Code/python-blosc/c-blosc/internal-complibs/zlib-1.2.8/gzlib.c:492:14: felmeddelande: övergripande fungerande uttalande av en gör hela jobbet 'lseek' skulle vara skadad bara genom att använda C99 [-Fel,-Wimplicit-funktionsdeklaration]   Offset motsvarar LSEEK(tillstånd->fd, 8, SEEK_CUR);             ^/Users/xian/Code/python-blosc/c-blosc/internal-complibs/zlib-1.2.8/gzlib.c:14:17: dokument: tillämpat långt från makrot 'LSEEK'# kommentera LSEEK lseek                ^4 misstag genererade.make[2]: *** [c-blosc/blosc/CMakeFiles/blosc_static.dir/__/internal-complibs/zlib-1.2.8/gzlib.c.o] Fel 1make[1]: *** [c-blosc/blosc/CMakeFiles/blosc_static.dir/all] Fel 2make: *** [alla] Fel 2Spårning (de flesta mobiltelefonsamtal måste anges sist):  Filen "/Users/xian/pandas-dev-env/lib/python3.8/site-packages/skbuild/setuptools_wrap.py", onlineföretag 589, bakom installationen    cmkr.make(make_args, env=env)  Filen "/Users/xian/pandas-dev-env/lib/python3.8/site-packages/skbuild/cmaker.py", 496, rad inom make

    Skaffa en snabbare

    Implicit Declaration Of Function Lseek Is Invalid In C99
    La Dichiarazione Implicita Della Funzione Lseek Non E Valida In C99
    La Declaration Implicite De La Fonction Lseek N Est Pas Valide Dans C99
    Neyavnoe Obyavlenie Funkcii Lseek Nedopustimo V C99
    C99에서 Lseek 함수의 암시적 선언이 유효하지 않습니다
    La Declaracion Implicita De La Funcion Lseek No Es Valida En C99
    Impliciete Declaratie Van Functie Lseek Is Ongeldig In C99
    Die Implizite Deklaration Der Funktion Lseek Ist In C99 Ungultig
    Niejawna Deklaracja Funkcji Lseek Jest Nieprawidlowa W C99
    Declaracao Implicita Da Funcao Lseek E Invalida Em C99

    Related Posts